{"text_format":"1","workbook":"xlsx","n_sheets":4,"sheets":["viga","aux","IPE","HEB"],"not_rendered":{"charts":1,"images":0,"macros":1,"external_links":0,"defined_names":0,"comments":1,"pivot_tables":0},"unopened":[],"bounds":{"document_bytes":16777216,"sheet_cells":100000,"rows_first":2000,"rows_last":500,"rows_between":2000,"halvings":0,"cell_chars":16384,"cell_head_chars":4096},"cells_cut":0,"cells_raw":0,"read":"whole","date_system":"1900"}

{"sheet":"viga","index":0,"n_rows":139,"n_cols":25,"rows_kept":139,"cut":false,"hidden":false,"merged":[]}
["MATERIALS",null,null,null,"SLAB",null,null,null,"STEEL BEAM",null,null,null,"GEOMETRY",null,null,null,"LOADS",null,null,null,"ELASTIC INTERNAL FORCES",null,null,null,"Análisis plástico de solicitaciones: (suponemos clase 1, aunque clase 2 permite redistribuciones grandes)"]
["CONCRETE",null,null,null,"upper thickness","[mm]",60,null,"rank","[-]","primary",null,"L","[m]",6,null,"flooring","[kN/m2]",1,null,"Miso,ELU","[kNm]",{"$f":"$S$20*$O$2^2/8","v":254.24958375000003},null,"Tipo de solicitación para clase de sección: se entiende que siempre es flexión, no compresión (en tracción no hay abolladura)"]
["fck","[N/mm2]",25,null,"height ribs","[mm]",60,null,"type","[-]","HEB",null,"similar Ladj","[-]","N",null,"walls","[kN/m2]",1,null,"Vel,ELU,pers,A","[kN]",{"$f":"$S$20*$O$2*N24","v":127.12479187500001}]
["cement","[-]","normal",null,"width ribs","[mm]",100,null,"size","[mm]",200,null,"Ladj,diff,A","[m]",0,null,"other G","[kN/m2]",null,null,"Vel,ELU,pers,B","[kN]",{"$f":"$S$20*$O$2*N25","v":211.87465312500001},null,"Se calcula la resistencia a positivos, y se obtiene la curva de momentos compatible"]
["exposition to RH","[-]","none",null,"dist ribs","[mm]",210,null,"following rank type","[-]","IPE",null,"Ladj,diff,B","[m]",2.4,null,"Q","[kN/m2]",3,null,"Mel,ELU,pers,A","[kNm]",{"$f":"$S$20*$O$2^2*N26","v":0},null,"con las cargas (i.e. que cumple momento isostático) y los apoyos, y se la hace pasar por el M resistente"]
["RH","[-]",0.5,null,"total depth","[mm]",{"$f":"G2+G3","v":120},null,"following rank size","[mm]",100,null,"similar transv. range","[-]","N",null,"cathegory Q","-","use A-B, snow high",null,"Mel,ELU,pers,C","[kNm]",{"$f":"$S$20*$O$2^2*N27","v":127.12479187500001},null,"a positivos (reducido un poco en el caso de pin-fix para considerar que la \"panza\" se alcanza un poco "]
["t0","[days]",7,null,"full/empty","[-]",{"$f":"IF(G3=0,1,G4/G5)","v":0.47619047619047616},null,"following rank dist","[m]",1.5,null,"transv. range left","[m]",5,null,"partition walls","-","average",null,"Mel,ELU,pers,B","[kNm]",{"$f":"$S$20*$O$2^2*N28","v":254.24958375000003},null,"hacia el extremo apoyado), calculándose los M negativos solicitación (primero en B y luego en A)"]
["Creep code","[-]","average",null,"eq. thickness","[mm]",{"$f":"G2+G7*G3","v":88.571428571428569},null,"following rank weight","[kN/m]",{"$f":"IF(K6=0,0,0.01*IF(K5=aux!K2,INDEX(IPE!B3:B21,MATCH(K6,IPE!A3:A21,0)),IF(K5=aux!K3,INDEX(HEB!B3:B21,MATCH(K6,HEB!A3:A21,0)))))","v":8.1000000000000003E-2},null,"transv. range diff (right)","[m]",5.85,null,"steel profiles","[kN/m2]",{"$f":"K11/((O14+O15)/1000)+IF(K2=aux!C2,0,K8/K7)","v":0.16699539170506913},null,"Mel,ELS,pers,A","[kNm]",{"$f":"$S$25*$O$2^2*N26","v":0},null,"Esto permitiría teóricamente redistribuciones negativas (i.e. hacia arriba),"]
["γc","[-]",1.5,null,"r top","[mm]",20,null,"BEAM PROPERTIES",null,null,null,"Ladj,A","[m]",{"$f":"IF(O3=aux!A1,O2,IF(O4=0,O2,O4))","v":6},null,"slab","[kN/m2]",{"$f":"25*G8/1000","v":2.2142857142857144},null,"Mel,ELS,pers,C","[kNm]",{"$f":"$S$25*$O$2^2*N27","v":90.097762500000016},null,"En cualquier caso, se ofrece el valor de Md+,C (positivo solictación en CV)"]
["fcd","[N/mm2]",{"$f":"C3/C9","v":16.666666666666668},null,"r wave","[mm]",25,null,"class (bending)","[-]",{"$f":"IF(K3=aux!K2,INDEX(IF(C36=aux!B2,IPE!X3:X21,IF(C36=aux!B3,IPE!Y3:Y21,IPE!Z3:Z21)),MATCH(K4,IPE!A3:A21,0)),IF(K3=aux!K3,INDEX(IF(C36=aux!B2,HEB!X3:X21,IF(C36=aux!B3,HEB!Y3:Y21,HEB!Z3:Z21)),MATCH(K4,HEB!A3:A21,0))))","v":1},null,"Ladj,B","[m]",{"$f":"IF(O3=aux!A1,O2,IF(O5=0,O2,O5))","v":2.4},null,"G","[kN/m2]",{"$f":"SUM(S2:S4)+SUM(S8:S9)","v":4.3812811059907837},null,"Mel,ELS,pers,B","[kNm]",{"$f":"$S$25*$O$2^2*N28","v":180.19552500000003},null,"para que se pueda obligar a que no aparezca ahí una rótula plástica."]
["fcm","[N/mm2]",{"$f":"C3+8","v":33},null,"# φ","[mm]",6,null,"weight","[kN/m]",{"$f":"0.01*IF(K3=aux!K2,INDEX(IPE!B3:B21,MATCH(K4,IPE!A3:A21,0)),IF(K3=aux!K3,INDEX(HEB!B3:B21,MATCH(K4,HEB!A3:A21,0))))","v":0.61299999999999999},null,"Lmed,A","[m]",{"$f":"AVERAGE(O2,O9)","v":6},null,"γG","-",1.35,null,"manual","[Y/N]","N"]
["Ecm,28","[N/mm2]",{"$f":"22000*((C3+8)/10)^0.3","v":31475.806210019346},null,"distance","[mm]",200,null,"b","[mm]",{"$f":"IF(K3=aux!K2,INDEX(IPE!D3:D21,MATCH(K4,IPE!A3:A21,0)),IF(K3=aux!K3,INDEX(HEB!D3:D21,MATCH(K4,HEB!A3:A21,0))))","v":200},null,"Lmed,B","[m]",{"$f":"AVERAGE(O2,O10)","v":4.2},null,"γQ","-",1.5,null,"Vel,ELU,pers,A","[kN]"]
["s (coef. cem)","[-]",{"$f":"IF(C4=aux!V2,aux!W2,IF(C4=aux!V3,aux!W3,aux!W4))","v":0.25},null,"φ ribs","[mm]",0,null,"h","[mm]",{"$f":"K4","v":200},null,"transv. range right","[m]",{"$f":"IF(O6=aux!A1,O7,O8)","v":5.85},null,"Ψ1","-",{"$f":"IF(S6=aux!G2,aux!H2,IF(S6=aux!G3,aux!H3,IF(S6=aux!G4,aux!H4,IF(S6=aux!G5,aux!H5))))","v":0.5},null,"Vel,ELU,pers,B","[kN]",null,null,"La evaluación de la interacción por cortante se hace"]
["t ∞","[days]",10000,null,"each n ribs","[-]",0,null,"tf","[mm]",{"$f":"IF(K3=aux!K2,INDEX(IPE!F3:F21,MATCH(K4,IPE!A3:A21,0)),IF(K3=aux!K3,INDEX(HEB!F3:F21,MATCH(K4,HEB!A3:A21,0))))","v":15},null,"b,left","[mm]",{"$f":"O7/2*1000","v":2500},null,"Ψ2","-",{"$f":"IF(S6=aux!G2,aux!I2,IF(S6=aux!G3,aux!I3,IF(S6=aux!G4,aux!I4,IF(S6=aux!G5,aux!I5))))","v":0.3},null,"Mel,ELU,pers,A","[kNm]",null,null,"sobre la distribución de solicitaciones elástica;"]
["βcc","[-]",{"$f":"EXP(C13*(1-(28/C14)^0.5))","v":1.2671512154708973},null,"deck thickness","[mm]",0.8,null,"tw","[mm]",{"$f":"IF(K3=aux!K2,INDEX(IPE!E3:E21,MATCH(K4,IPE!A3:A21,0)),IF(K3=aux!K3,INDEX(HEB!E3:E21,MATCH(K4,HEB!A3:A21,0))))","v":9},null,"b,right","[mm]",{"$f":"O13/2*1000","v":2925},null,"ηfi","-",{"$f":"S17/S16","v":0.5647080041679714},null,"Mel,ELU,pers,C","[kNm]",null,null,"puede ser una simplificación suficiente."]
["Creep factor EC4","[-]",{"$f":"1+C17*C18","v":2.9576274306783441},null,"eq deck thickness","[mm]",{"$f":"G15*(G5+2*G3)/G5","v":1.2571428571428571},null,"tw,eq","[mm]",{"$f":"K20/K17","v":10.639058823529414},null,null,null,null,null,"P,ELU,pers","[kN/m2]",{"$f":"S10*S11+S5*S12","v":10.41472949308756},null,"Mel,ELU,pers,B","[kNm]"]
["ΨL","[-]",1.1000000000000001,null,null,null,null,null,"hw","[mm]",{"$f":"K13-2*K14","v":170},null,"BOUNDARY CONDITIONS",null,null,null,"P,ELU,acc","[kN/m2]",{"$f":"S10+S5*S13","v":5.8812811059907837},null,"Mel,ELS,pers,A","[kNm]",null,null,"Para el cálculo de conectores, se podría hacer por capacidad,"]
["ϕt","[-]",{"$f":"C19*C22","v":1.7796613006166764},null,"STUDS",null,null,null,"A","[mm2]",{"$f":"IF(K3=aux!K2,INDEX(IPE!H3:H21,MATCH(K4,IPE!A3:A21,0)),IF(K3=aux!K3,INDEX(HEB!H3:H21,MATCH(K4,HEB!A3:A21,0))))","v":7808.64},null,"constraint A","pin",null,null,"P,ELS,pers","[kN/m2]",{"$f":"S10+S5","v":7.3812811059907837},null,"Mel,ELS,pers,C","[kNm]",null,null,"es decir, para que siempre tuvieran más resistencia que las"]
["ϕ0","[-]",{"$f":"C20*16.8/(C11)^0.5/(0.1+C7^0.2)","v":1.8559172673663049},null,"n in a row","[-]",1,null,"A,flange","[mm2]",{"$f":"K12*K14","v":3000},null,"constraint B","fix",null,null,"P,ELS,cuasi","[kN/m2]",{"$f":"S10+S14*S5","v":5.281281105990784},null,"Mel,ELS,pers,B","[kNm]",null,null,"piezas, pero parece exagerado sobre todo cuando hay mucha"]
["ϕRH","[-]",{"$f":"(1+(1-C6)/(0.1*C21^(1/3))*IF(C11<=35,1,(35/C11)^0.7))*IF(C11<=35,1,(35/C11)^0.2)","v":1},null,"b0","[mm]",0,null,"A,web","[mm2]",{"$f":"K18-2*K19","v":1808.6400000000003},null,"global constraint",{"$f":"IF(CONCATENATE(N18,\"-\",N19)=\"fix-pin\",\"IMPOSSIBLE\",CONCATENATE(N18,\"-\",N19))","v":"pin-fix"},null,null,"q,ELU,pers","[kN/m]",{"$f":"S16*($O$14+$O$15)/1000","v":56.499907500000006},null,"Vel,ELU,pers,A","[kN]",{"$f":"IF($W$11=aux!$A$2,W3,W12)","v":127.12479187500001},null,"sobrerresistencia a momento."]
{"$rows_left_out":120}
{"sheet":"aux","index":1,"n_rows":21,"n_cols":36,"rows_kept":21,"cut":false,"hidden":false,"merged":[]}
["Y","fsk","family","walls","L/δ max","constraint","Q cathegory","Ψ1","Ψ2","φ","profile type","global constraint","factor L A","factor L C","factor L B","factor V A","factor V B","factor M A","factor M C","factor M B","facfor δ","cement","s","exposition to RH","factor panza","class","time term","bending sign","Creep code","type redistibution",null,"M type","type redistribution","MA","MC","MB"]
["N",235,"secondary","brittle",500,"fix","snow low",0.2,0,5,"IPE","free-fix",2,2,2,0,1,0,0,0.5,{"$f":"1/8","v":0.125},"fast",0.2,"top and bottom",{"$f":"128/144","v":0.88888888888888884},1,"short","+","EC4","AB",null,"el","overdesign all",{"$f":"AF2","v":"el"},{"$f":"AF2","v":"el"},{"$f":"AF2","v":"el"}]
[null,275,"primary","average",400,"pin","use A-B, snow high",0.5,0.3,6,"HEB","pin-pin",0.85,1,0.85,0.5,0.5,0,{"$f":"1/8","v":0.125},0,{"$f":"5/384","v":1.3020833333333334E-2},"normal",0.25,"top",null,"≥2","long","-","EHE-08","AC",null,"R","fail",{"$f":"AF3","v":"R"},{"$f":"AF4","v":"cal"},{"$f":"AF3","v":"R"}]
[null,335,null,"no",300,"free","use C-D-E",0.7,0.6,8,null,"pin-fix",0.85,0.85,0.5,{"$f":"3/8","v":0.375},{"$f":"5/8","v":0.625},0,{"$f":"1/16","v":6.25E-2},{"$f":"1/8","v":0.125},{"$f":"1/185","v":5.4054054054054057E-3},"slow",0.38,"bottom",null,null,"any",null,"average","BC",null,"cal","a BC1",{"$f":"AF3","v":"R"},{"$f":"AF4","v":"cal"},{"$f":"AF2","v":"el"}]
[null,null,null,null,null,null,"use G",0,0,10,null,"fix-fix",0.5,0.7,0.5,0.5,0.5,{"$f":"1/12","v":8.3333333333333329E-2},{"$f":"1/24","v":4.1666666666666664E-2},{"$f":"1/12","v":8.3333333333333329E-2},{"$f":"1/384","v":2.6041666666666665E-3},null,null,"none",null,null,null,null,null,null,null,"esp","a BC2",{"$f":"AF3","v":"R"},{"$f":"AF3","v":"R"},{"$f":"AF4","v":"cal"}]
[null,null,null,null,null,null,null,null,null,12,null,null,null,null,null,null,null,null,"pin-plasticHinge-fix",null,{"$f":"1/128+1/96","v":1.8229166666666664E-2},null,null,null,null,null,null,null,null,null,null,null,"b AC1",{"$f":"AJ4","v":"el"},{"$f":"AI4","v":"cal"},{"$f":"AH4","v":"R"}]
[null,null,null,null,null,null,null,null,null,16,null,null,null,null,null,null,null,null,"fix-plastic-Hinge-fix",null,{"$f":"1/128","v":7.8125E-3},null,null,null,null,null,null,null,null,null,null,null,"b AC2",{"$f":"AJ5","v":"cal"},{"$f":"AI5","v":"R"},{"$f":"AH5","v":"R"}]
[null,null,null,null,null,null,null,null,null,20,null,null,null,null,null,null,null,null,null,null,null,null,null,null,null,null,null,null,null,null,null,null,"ab C",{"$f":"AF3","v":"R"},{"$f":"AF4","v":"cal"},{"$f":"AF3","v":"R"}]
[null,null,null,null,null,null,null,null,null,0,null,null,null,null,null,null,null,null,null,null,null,null,null,null,null,null,null,null,null,null,null,null,"ba C",{"$f":"AF3","v":"R"},{"$f":"AF4","v":"cal"},{"$f":"AF3","v":"R"}]
[null,null,null,null,null,null,null,null,null,null,null,null,null,null,null,null,null,null,null,null,null,null,null,null,null,null,null,null,null,null,null,null,"a CB1",{"$f":"AF3","v":"R"},{"$f":"AF4","v":"cal"},{"$f":"AF2","v":"el"}]
[null,null,null,null,null,null,null,null,null,null,null,null,null,null,null,null,null,null,null,null,null,null,null,null,null,null,null,null,null,null,null,null,"a CB2",{"$f":"AF3","v":"R"},{"$f":"AF3","v":"R"},{"$f":"AF4","v":"cal"}]
[null,null,null,null,null,null,null,null,null,null,null,null,null,null,null,null,null,null,null,null,null,null,null,null,null,null,null,null,null,null,null,null,"b CA1",{"$f":"AJ10","v":"el"},{"$f":"AI10","v":"cal"},{"$f":"AH10","v":"R"}]
[null,null,null,null,null,null,null,null,null,null,null,null,null,null,null,null,null,null,null,null,null,null,null,null,null,null,null,null,null,null,null,null,"b CA2",{"$f":"AJ11","v":"cal"},{"$f":"AI11","v":"R"},{"$f":"AH11","v":"R"}]
[null,null,null,null,null,null,null,null,null,null,null,null,null,null,null,null,null,null,null,null,null,null,null,null,null,null,null,null,null,null,null,null,"ac B",{"$f":"AF3","v":"R"},{"$f":"AF3","v":"R"},{"$f":"AF4","v":"cal"}]
[null,null,null,null,null,null,null,null,null,null,null,null,null,null,null,null,null,null,null,null,null,null,null,null,null,null,null,null,null,null,null,null,"ca B",{"$f":"AF3","v":"R"},{"$f":"AF3","v":"R"},{"$f":"AF4","v":"cal"}]
[null,null,null,null,null,null,null,null,null,null,null,null,null,null,null,null,null,null,null,null,null,null,null,null,null,null,null,null,null,null,null,null,"bc A",{"$f":"AJ14","v":"cal"},{"$f":"AI14","v":"R"},{"$f":"AH14","v":"R"}]
[null,null,null,null,null,null,null,null,null,null,null,null,null,null,null,null,null,null,null,null,null,null,null,null,null,null,null,null,null,null,null,null,"cb A",{"$f":"AJ15","v":"cal"},{"$f":"AI15","v":"R"},{"$f":"AH15","v":"R"}]
[null,null,null,null,null,null,null,null,null,null,null,null,null,null,null,null,null,null,null,null,null,null,null,null,null,null,null,null,null,null,null,null,"c AB1",{"$f":"AF3","v":"R"},{"$f":"AF3","v":"R"},{"$f":"AF4","v":"cal"}]
[null,null,null,null,null,null,null,null,null,null,null,null,null,null,null,null,null,null,null,null,null,null,null,null,null,null,null,null,null,null,null,null,"c AB2",{"$f":"AF5","v":"esp"},{"$f":"AF3","v":"R"},{"$f":"AF4","v":"cal"}]
[null,null,null,null,null,null,null,null,null,null,null,null,null,null,null,null,null,null,null,null,null,null,null,null,null,null,null,null,null,null,null,null,"c BA1",{"$f":"AJ18","v":"cal"},{"$f":"AI18","v":"R"},{"$f":"AH18","v":"R"}]
{"$rows_left_out":2}
{"sheet":"IPE","index":2,"n_rows":20,"n_cols":40,"rows_kept":20,"cut":false,"hidden":false,"merged":[]}
["series","weight","h","b","tw","tf","r","A","I strong","Wel strong","Wpl strong","i strong","Av strong","I weak","Wel weak","Wpl weak","i weak","ss","It","Iw","class, compression",null,null,"class, bending",null,null,"Npl,Rd",null,null,"Mpl,Rd strong",null,null,"Mpl,Rd weak",null,null,"Vpl,Rd strong",null,null,null,"perimeter non protected"]
["-","[kp/m]","[mm]","[mm]","[mm]","[mm]","[mm]","[mm2]","[cm4]","[cm3]","[cm3]","[mm]","[mm2]","[cm4]","[cm3]","[cm3]","[mm]","[mm]","[cm4]","[]","S235","S275","S335","S235","S275","S335","S235","S275","S335","S235","S275","S335","S235","S275","S335","S235","S275","S335",null,"[mm]"]
[80,6,80,46,3.8,5.2,5,764.38,80.14,20.03,23.22,32.380000000000003,357.74,8.49,3.69,5.82,10.54,20.059999999999999,0.7,0.12,1,1,1,1,1,1,171.1,200.2,258.39999999999998,5.2,6.08,7.85,1.3,1.52,1.97,46.23,54.09,69.83,null,{"$f":"3*D3-2*E3+2*C3+(2*PI()-8)*G3","v":281.81592653589792}]
[100,8.1,100,55,4.0999999999999996,5.7,7,1032.4000000000001,171.01,34.200000000000003,39.409999999999997,40.700000000000003,508.57,15.92,5.79,9.15,12.42,23.7,1.2,0.35,1,1,1,1,1,1,231.1,270.39999999999998,349,8.82,10.32,13.32,2.0499999999999998,2.4,3.09,65.72,76.900000000000006,99.27,null,344.78229715025714]
[120,10.37,120,64,4.4000000000000004,6.3,7,1321.1,317.75,52.96,60.73,49.04,630.62,27.67,8.65,13.58,14.47,25.2,1.74,0.89,1,1,1,1,1,1,295.7,346,446.7,13.59,15.9,20.53,3.04,3.56,4.59,81.489999999999995,95.36,123.1,null,411.18229715025711]
[140,12.9,140,73,4.7,6.9,7,1642.68,541.22,77.319999999999993,88.34,57.4,764.31,44.92,12.31,19.25,16.54,26.7,2.4500000000000002,1.98,1,1,2,1,1,1,367.6,430.2,555.4,19.77,23.14,29.87,4.3099999999999996,5.04,6.51,98.76,115.6,149.19999999999999,null,477.58229715025715]
[160,15.77,160,82,5,7.4,9,2009.26,869.29,108.66,123.86,65.78,965.86,68.31,16.66,26.1,18.440000000000001,30.34,3.6,3.96,1,1,2,1,1,1,449.7,526.20000000000005,679.3,27.72,32.44,41.88,5.84,6.84,8.82,124.8,146,188.5,null,540.54866776461631]
[180,18.8,180,91,5.3,8,9,2394.86,1316.96,146.33000000000001,166.41,74.16,1125.26,100.85,22.16,34.6,20.52,31.84,4.79,7.43,1,2,3,1,1,1,536,627.20000000000005,809.7,37.25,43.58,56.26,7.74,9.06,11.7,145.4,170.2,219.7,null,606.94866776461629]
[200,22.36,200,100,5.6,8.5,12,2848.64,1943.17,194.32,220.64,82.59,1400.24,142.37,28.47,44.61,22.36,36.659999999999997,6.98,12.99,1,2,3,1,1,1,637.6,746.1,963.1,49.38,57.79,74.599999999999994,9.98,11.68,15.08,180.9,211.7,273.3,null,668.19822368615496]
[220,26.2,220,110,5.9,9.1999999999999993,12,3337.28,2771.84,251.99,285.41000000000003,91.14,1588.36,204.89,37.25,58.11,24.78,38.36,9.07,22.67,2,2,3,1,1,1,746.9,874,1128,63.88,74.75,96.49,13.01,15.22,19.649999999999999,205.2,240.2,310,null,737.59822368615505]
[240,30.71,240,120,6.2,9.8000000000000007,15,3911.98,3891.62,324.3,366.65,99.74,1914.74,283.63,47.27,73.92,26.93,43.37,12.88,37.39,2,3,4,1,1,1,875.5,1025,"-",82.06,96.03,124,16.54,19.36,24.99,247.4,289.5,373.8,null,801.84777960769384]
[270,36.07,270,135,6.6,10.199999999999999,15,4594.8599999999997,5789.78,428.87,484,112.25,2214.1799999999998,419.87,62.2,96.95,30.23,44.57,15.94,70.58,2,3,4,1,1,1,1028,1203,"-",108.3,126.8,163.6,21.7,25.39,32.78,286.10000000000002,334.8,432.2,null,906.04777960769377]
[300,42.25,300,150,7.1,10.7,15,5381.56,8356.1,557.07000000000005,628.36,124.61,2568.5300000000002,603.78,80.5,125.22,33.5,46.07,20.12,125.93,3,4,4,1,1,1,1204,"-","-",140.6,164.6,212.4,28.03,32.799999999999997,42.34,331.9,388.4,501.4,null,1010.0477796076938]
[330,49.15,330,160,7.5,11.5,18,6261.14,11766.89,713.15,804.33,137.09,3081.39,788.14,98.52,153.68,35.479999999999997,51.59,28.15,199.1,3,4,4,1,1,1,1401,"-","-",180,210.7,271.89999999999998,34.39,40.25,51.96,398.2,465.9,601.5,null,1094.0973355292326]
[360,57.1,360,170,8,12.7,18,7273.44,16265.62,903.65,1019.15,149.54,3514.24,1043.45,122.76,191.1,37.880000000000003,54.49,37.32,313.58,3,4,4,1,1,1,1628,"-","-",228.1,266.89999999999998,344.6,42.77,50.05,64.61,454.1,531.4,686,null,1183.0973355292326]
[400,66.31,400,180,8.6,13.5,21,8447.06,23128.35,1156.42,1307.1500000000001,165.47,4270.16,1317.82,146.41999999999999,229,39.5,60.2,51.08,490.05,4,4,4,1,1,1,"-","-","-",292.60000000000002,342.3,441.9,51.25,59.98,77.42,551.79999999999995,645.70000000000005,833.5,null,1286.7468914507713]
[450,77.58,450,190,9.4,14.6,21,9882.7800000000007,33742.910000000003,1499.69,1701.79,184.78,5085.22,1675.86,176.41,276.38,41.18,63.2,66.87,791.01,4,4,4,1,1,1,"-","-","-",380.9,445.7,575.4,61.86,72.39,93.44,657.1,768.9,992.6,null,1415.1468914507714]
[500,90.69,500,200,10.199999999999999,16,21,11552.86,48198.5,1927.94,2194.12,204.25,5988.06,2141.6799999999998,214.17,335.88,43.06,66.8,89.29,1249.3699999999999,4,4,4,1,1,1,"-","-","-",491.1,574.6,741.8,75.17,87.97,113.6,773.8,905.5,1169,null,1543.5468914507712]
[550,105.52,550,210,11.1,17.2,24,13442.52,67116.460000000006,2440.6,2787.01,223.45,7235.04,2667.58,254.06,400.54,44.55,73.62,123.24,1884.1,4,4,4,1,1,1,"-","-","-",623.79999999999995,729.9,942.3,89.64,104.9,135.4,934.9,1094,1412,null,1666.59644737231]
[600,122.45,600,220,12,19,24,15599.36,92083.4,3069.45,3512.4,242.96,8379.36,3387.34,307.94,485.65,46.6,78.12,165.42,2845.53,4,4,4,1,1,1,"-","-","-",786.1,919.9,1188,108.7,127.2,164.2,1083,1267,1636,null,1794.79644737231]
{"$rows_left_out":1}
{"sheet":"HEB","index":3,"n_rows":21,"n_cols":40,"rows_kept":21,"cut":false,"hidden":false,"merged":[]}
["series","weight","h","b","tw","tf","r","A","I strong","Wel strong","Wpl strong","i strong","Av strong","I weak","Wel weak","Wpl weak","i weak","ss","It","Iw","class, compression",null,null,"class, bending",null,null,"Npl,Rd",null,null,"Mpl,Rd strong",null,null,"Mpl,Rd weak",null,null,"Vpl,Rd strong",null,null,null,"perimeter non protected"]
["-","[kp/m]","[mm]","[mm]","[mm]","[mm]","[mm]","[mm2]","[cm4]","[cm3]","[cm3]","[mm]","[mm2]","[cm4]","[cm3]","[cm3]","[mm]","[mm]","[cm4]","[]","S235","S275","S335","S235","S275","S335","S235","S275","S335","S235","S275","S335","S235","S275","S335","S235","S275","S335",null,"[mm]"]
[100,20.399999999999999,100,100,6,10,12,2603.84,449.54,89.91,104.21,41.55,903.84,167.27,33.450000000000003,51.42,25.35,40.06,9.25,3.38,1,1,1,1,1,1,582.76,681.96,880.35,23.32,27.29,35.229999999999997,11.51,13.47,17.39,116.79,136.66999999999999,176.43,null,{"$f":"3*D3-2*E3+2*C3+(2*PI()-8)*G3","v":467.39822368615501}]
[120,26.7,120,120,6.5,11,12,3400.84,864.37,144.06,165.21,50.41,1096.3399999999999,317.52,52.92,80.97,30.56,42.56,13.84,9.41,1,1,1,1,1,1,761.14,890.7,1149.81,36.979999999999997,43.27,55.86,18.12,21.21,27.37,141.66999999999999,165.78,214,null,566.39822368615501]
[140,33.700000000000003,140,140,7,12,12,4295.84,1509.23,215.6,245.43,59.27,1307.8399999999999,549.66999999999996,78.52,119.78,35.770000000000003,45.06,20.059999999999999,22.48,1,1,1,1,1,1,961.45,1125.0999999999999,1452.4,54.93,64.28,82.98,26.81,31.37,40.5,168.99,197.76,255.29,null,665.39822368615501]
[160,42.6,160,160,8,13,15,5425.5,2492,311.5,353.97,67.77,1759.5,889.23,111.15,169.96,40.479999999999997,51.57,31.24,47.94,1,1,1,1,1,1,1214.28,1420.96,1834.34,79.22,92.71,119.67,38.04,44.51,57.46,227.36,266.06,343.45,null,758.24777960769381]
[180,51.2,180,180,8.5,14,15,6525.5,3831.13,425.68,481.45,76.62,2024.5,1362.85,151.43,231.01,45.7,54.07,42.16,93.75,1,1,1,1,1,1,1460.47,1709.06,2206.2399999999998,107.75,126.09,162.78,51.7,60.5,78.099999999999994,261.60000000000002,306.13,395.18,null,857.24777960769381]
[200,61.3,200,200,9,15,18,7808.64,5696.17,569.62,642.54999999999995,85.41,2483.64,2003.37,200.34,305.81,50.65,60.09,59.28,171.13,1,1,1,1,1,1,1747.65,2045.12,2640.06,143.81,168.29,217.24,68.44,80.09,103.39,320.93,375.55,484.8,null,951.09733552923251]
[220,71.5,220,220,9.5,16,18,9104.64,8090.96,735.54,827.05,94.27,2792.64,2843.26,258.48,393.88,55.88,62.59,76.569999999999993,295.42,1,1,1,1,1,1,2037.71,2384.5500000000002,3078.24,185.1,216.61,279.62,88.15,103.16,133.16999999999999,360.86,422.28,545.12,null,1050.0973355292326]
[240,83.2,240,240,10,17,21,10599.26,11259.29,938.27,1053.1500000000001,103.07,3323.26,3922.66,326.89,498.42,60.83,68.599999999999994,102.69,486.95,1,1,1,1,1,1,2372.2199999999998,2776,3583.56,235.7,275.82,356.06,111.55,130.54,168.51,429.42,502.51,648.70000000000005,null,1143.9468914507713]
[260,93,260,260,10,17.5,24,11845.36,14919.41,1147.6500000000001,1282.9100000000001,112.23,3760.36,5134.51,394.96,602.25,65.84,73.12,123.78,753.65,1,1,1,1,1,1,2651.1,3102.36,4004.86,287.13,336,433.75,134.79,157.72999999999999,203.62,485.9,568.61,734.02,null,1238.79644737231]
[280,103,280,280,10.5,18,24,13137.36,19270.25,1376.45,1534.43,121.11,4110.3599999999997,6594.52,471.04,717.57,70.849999999999994,74.62,143.72,1130.1500000000001,1,1,1,1,1,1,2940.27,3440.74,4441.68,343.42,401.88,518.78,160.6,187.94,242.61,531.13,621.53,802.34,null,1337.79644737231]
[300,117,300,300,11,19,27,14908.94,25165.65,1677.71,1868.67,129.91999999999999,4743.9399999999996,8562.82,570.85,870.14,75.790000000000006,80.63,185.05,1687.79,1,1,1,1,1,1,3336.76,3904.72,5040.6400000000003,418.23,489.41,631.79,194.75,227.89,294.19,613,717.33,926.01,null,1431.6460032938489]
[320,127,320,300,11.5,20.5,27,16135.44,30823.51,1926.47,2149.2399999999998,138.21,5178.1899999999996,9238.82,615.91999999999996,939.1,75.67,84.13,225.07,2068.71,1,1,1,1,1,1,3611.27,4225.95,5455.32,481.02,562.9,726.65,210.18,245.95,317.5,669.11,783,1010.78,null,1470.6460032938489]
[340,134,340,300,12,21.5,27,17090.939999999999,36656.36,2156.2600000000002,2408.11,146.44999999999999,5609.94,9689.93,646,985.72,75.3,86.63,257.2,2453.63,1,1,1,1,1,1,3825.12,4476.2,5778.37,538.96,630.69000000000005,814.17,220.61,258.16000000000003,333.27,724.9,848.28,1095.06,null,1509.6460032938489]
[360,142,360,300,12.5,22.5,27,18064.439999999999,43193.42,2399.63,2682.99,154.63,6060.69,10141.16,676.08,1032.49,74.930000000000007,89.13,292.45,2883.25,1,1,1,1,1,1,4042.99,4731.16,6107.5,600.48,702.69,907.11,231.08,270.41000000000003,349.08,783.14,916.44,1183.04,null,1548.6460032938489]
[400,155,400,300,13.5,24,27,19778.939999999999,57680.480000000003,2884.02,3231.74,170.77,6998.94,10819.03,721.27,1104.04,73.959999999999994,93.13,355.75,3817.15,1,1,1,1,1,1,4426.72,5180.2,6687.17,723.29,846.41,1092.6400000000001,247.09,289.14999999999998,373.27,904.38,1058.32,1366.19,null,1626.6460032938489]
[450,171,450,300,14,26,27,21798.94,79887.520000000004,3550.56,3982.37,191.44,7966.94,11721.32,781.42,1197.6600000000001,73.33,97.63,440.48,5258.45,1,1,2,1,1,1,4878.8100000000004,5709.25,7370.12,891.29,1043,1346.42,268.05,313.67,404.92,1029.46,1204.69,1555.14,null,1725.6460032938489]
[500,187,500,300,14.5,28,27,23864.94,107175.73,4287.03,4814.57,211.92,8982.94,12623.91,841.59,1291.6500000000001,72.73,102.13,538.44000000000005,7017.7,1,2,2,1,1,1,5341.2,6250.34,8068.62,1077.55,1260.96,1627.78,289.08,338.29,436.7,1160.74,1358.32,1753.46,null,1824.6460032938489]
[550,199,550,300,15,29,27,25406.94,136690.81,4970.57,5590.61,231.95,10007.94,13076.89,871.79,1341.14,71.739999999999995,104.63,600.33000000000004,8855.76,1,2,3,1,1,1,5686.32,6654.2,8589.9699999999993,1251.23,1464.21,1890.16,300.16000000000003,351.25,453.43,1293.19,1513.31,1953.54,null,1923.6460032938489]
{"$rows_left_out":1}